Reaction Details
TargetSodium- and chloride-dependent glycine transporter 1
LigandBDBM50195169
Substrate/Competitorn/a
Meas. Tech.ChEMBL_424802 (CHEMBL909051)
IC50 2.4±n/a nM
Citation Zhao, ZO'Brien, JALemaire, WWilliams, DLJacobson, MASur, CPettibone, DJTiller, PRSmith, SHartman, GDWolkenberg, SELindsley, CW Synthesis and SAR of GlyT1 inhibitors derived from a series of N-((4-(morpholine-4-carbonyl)-1-(propylsulfonyl)piperidin-4-yl)methyl)benzamides. Bioorg Med Chem Lett16:5968-72 (2006) 
 
Sodium- and chloride-dependent glycine transporter 1
Name:Sodium- and chloride-dependent glycine transporter 1
Type:Enzyme
Mol. Mass.:78270.54
Organism:Homo sapiens (Human)
Description:P48067
Residue:706
BDBM50195169
NameBDBM50195169
Synonyms:2,4-dichloro-N-((4-(morpholine-4-carbonyl)-1-(propylsulfonyl)piperidin-4-yl)methyl)benzamide | CHEMBL376472
TypeSmall organic molecule
Emp. Form.C21H29Cl2N3O5S
Mol. Mass.506.443
SMILESCCCS(=O)(=O)N1CCC(CNC(=O)c2ccc(Cl)cc2Cl)(CC1)C(=O)N1CCOCC1