Reaction Details
TargetSodium- and chloride-dependent glycine transporter 1
LigandBDBM50195170
Substrate/Competitorn/a
Meas. Tech.ChEMBL_424803 (CHEMBL909052)
IC50 18±n/a nM
Citation Zhao, ZO'Brien, JALemaire, WWilliams, DLJacobson, MASur, CPettibone, DJTiller, PRSmith, SHartman, GDWolkenberg, SELindsley, CW Synthesis and SAR of GlyT1 inhibitors derived from a series of N-((4-(morpholine-4-carbonyl)-1-(propylsulfonyl)piperidin-4-yl)methyl)benzamides. Bioorg Med Chem Lett16:5968-72 (2006) 
 
Sodium- and chloride-dependent glycine transporter 1
Name:Sodium- and chloride-dependent glycine transporter 1
Type:Enzyme Catalytic Domain
Mol. Mass.:71066.17
Organism:attus norvegicus (Rat)
Description:Glycine-1-transporter 0 HUMAN::P28572
Residue:638
BDBM50195170
NameBDBM50195170
Synonyms:2-chloro-N-((4-(morpholine-4-carbonyl)-1-(propylsulfonyl)piperidin-4-yl)methyl)benzamide | CHEMBL219714
TypeSmall organic molecule
Emp. Form.C21H30ClN3O5S
Mol. Mass.471.998
SMILESCCCS(=O)(=O)N1CCC(CNC(=O)c2ccccc2Cl)(CC1)C(=O)N1CCOCC1