Reaction Details
TargetNucleoside triphosphate diphosphohydrolase 3
LigandBDBM50195359
Substrate/Competitorn/a
Meas. Tech.ChEMBL_424932 (CHEMBL911344)
Ki 112000±n/a nM
Citation Müller, CEIqbal, JBaqi, YZimmermann, HRöllich, AStephan, H Polyoxometalates--a new class of potent ecto-nucleoside triphosphate diphosphohydrolase (NTPDase) inhibitors. Bioorg Med Chem Lett16:5943-7 (2006) 
 
Nucleoside triphosphate diphosphohydrolase 3
Name:Nucleoside triphosphate diphosphohydrolase 3
Type:PROTEIN
Mol. Mass.:59110.31
Organism:Rattus norvegicus
Description:ChEMBL_612641
Residue:529
BDBM50195359
NameBDBM50195359
Synonyms:ARL-67156 | CHEMBL223145
TypeSmall organic molecule
Emp. Form.C15H20Br2N5O12P3
Mol. Mass.715.077
SMILESCCN(CC)c1ncnc2n(cnc12)[C@@H]1O[C@H](COP([O-])(=O)OP([O-])(=O)C(Br)(Br)P([O-])([O-])=O)[C@@H](O)[C@H]1O