Reaction Details
TargetPeroxisome proliferator-activated receptor gamma
LigandBDBM50085045
Substrate/Competitorn/a
Meas. Tech.ChEMBL_425010 (CHEMBL912531)
IC50 1285±n/a nM
Citation Henry, JRLi, YWarshawsky, AMBrozinick, JTHawkins, EDMisener, EABriere, DAMontrose-Rafizadeh, CZink, RWYumibe, NPAjamie, RTWilken, BDevanarayan, V Tetrahydroisoquinoline PPARgamma agonists: design of novel, highly selective non-TZD antihyperglycemic agents. Bioorg Med Chem Lett16:6293-7 (2006) 
 
Peroxisome proliferator-activated receptor gamma
Name:Peroxisome proliferator-activated receptor gamma
Type:Nuclear Receptor
Mol. Mass.:57613.46
Organism:Homo sapiens (Human)
Description:P37231
Residue:505
BDBM50085045
NameBDBM50085045
Synonyms:5-((4-((6-hydroxy-2,5,7,8-tetramethyl-3,4-dihydro-2H-chromen-2-yl)methoxy)phenyl)methyl)thiazolidine-2,4-dione 5-[4-(6-Hydroxy-2,5,7,8-tetramethyl-chroman-2-ylmethoxy)-benzy l]-thiazolidine-2,4-dione (troglitazone) 5-[4-(6-Hydroxy-2,5,7,8-tetramethyl-chroman-2-ylmethoxy)-benzyl]-thiazolidine-2,4-dione(troglitazone) CHEMBL408 CS-045 PRELAY TROGLITAZONE
TypeSmall organic molecule
Emp. Form.C24H27NO5S
Mol. Mass.441.54
SMILESCc1c(C)c2OC(C)(COc3ccc(Cc4sc(=O)[nH]c4O)cc3)CCc2c(C)c1O