Reaction Details
TargetNAD(P)H dehydrogenase [quinone] 1
LigandBDBM35525
Substrate/Competitorn/a
Meas. Tech.ChEMBL_425055 (CHEMBL911952)
IC50 450±n/a nM
Citation Nolan, KATimson, DJStratford, IJBryce, RA In silico identification and biochemical characterization of novel inhibitors of NQO1. Bioorg Med Chem Lett16:6246-54 (2006) 
 
NAD(P)H dehydrogenase [quinone] 1
Name:NAD(P)H dehydrogenase [quinone] 1
Type:Homodimer
Mol. Mass.:30874.82
Organism:Homo sapiens (Human)
Description:n/a
Residue:274
BDBM35525
NameBDBM35525
Synonyms:3,3''''-methylenebis(4-hydroxy-coumarin 3,3''''-methylenebis[4-hydroxycoumarin Bishydroxycoumarin DICUMAROL symmetric dicoumarol analogue, 1
TypeSmall organic molecule
Emp. Form.C19H12O6
Mol. Mass.336.295
SMILESOc1c(Cc2c(O)c3ccccc3oc2=O)c(=O)oc2ccccc12