Reaction Details
TargetEnoyl-acyl-carrier protein reductase
LigandBDBM50070942
Substrate/Competitorn/a
Meas. Tech.ChEMBL_425611 (CHEMBL910787)
Ki 186±n/a nM
Citation Sharma, SKParasuraman, PKumar, GSurolia, NSurolia, A Green tea catechins potentiate triclosan binding to enoyl-ACP reductase from Plasmodium falciparum (PfENR). J Med Chem50:765-75 (2007) 
 
Enoyl-acyl-carrier protein reductase
Name:Enoyl-acyl-carrier protein reductase
Synonyms:n/a
Type:PROTEIN
Mol. Mass.:49770.86
Organism:Plasmodium falciparum
Description:ChEMBL_795989
Residue:432
BDBM50070942
NameBDBM50070942
TypeSmall organic molecule
Emp. Form.C22H18O11
Mol. Mass.458.3717
SMILESOc1cc(O)c2C[C@@H](OC(=O)c3cc(O)c(O)c(O)c3)[C@H](Oc2c1)c1cc(O)c(O)c(O)c1