Reaction Details
TargetCystathionine beta-lyase MetC
LigandBDBM50370848
Substrate/Competitorn/a
Meas. Tech.ChEMBL_425863 (CHEMBL856866)
IC50 16000±n/a nM
Citation Ejim, LJBlanchard, JEKoteva, KPSumerfield, RElowe, NHChechetto, JDBrown, EDJunop, MSWright, GD Inhibitors of bacterial cystathionine beta-lyase: leads for new antimicrobial agents and probes of enzyme structure and function. J Med Chem50:755-64 (2007) 
 
Cystathionine beta-lyase MetC
Name:Cystathionine beta-lyase MetC
Type:PROTEIN
Mol. Mass.:43211.38
Organism:Escherichia coli K-12
Description:ChEMBL_425863
Residue:395
BDBM50370848
NameBDBM50370848
Synonyms:CHEMBL218058
TypeSmall organic molecule
Emp. Form.C21H16ClN3OS
Mol. Mass.393.889
SMILESCc1ccc2nc(sc2c1)-c1ccc(NC(=O)Nc2ccc(Cl)cc2)cc1