Reaction Details
TargetCystathionine beta-lyase MetC
LigandBDBM50370852
Substrate/Competitorn/a
Meas. Tech.ChEMBL_425863 (CHEMBL856866)
IC50 37000±n/a nM
Citation Ejim, LJBlanchard, JEKoteva, KPSumerfield, RElowe, NHChechetto, JDBrown, EDJunop, MSWright, GD Inhibitors of bacterial cystathionine beta-lyase: leads for new antimicrobial agents and probes of enzyme structure and function. J Med Chem50:755-64 (2007) 
 
Cystathionine beta-lyase MetC
Name:Cystathionine beta-lyase MetC
Type:PROTEIN
Mol. Mass.:43211.38
Organism:Escherichia coli K-12
Description:ChEMBL_425863
Residue:395
BDBM50370852
NameBDBM50370852
Synonyms:CHEMBL219322
TypeSmall organic molecule
Emp. Form.C10H10F3N3O2
Mol. Mass.261.2005
SMILESNNC(=O)CNC(=O)c1cccc(c1)C(F)(F)F