Reaction Details
TargetCystathionine beta-lyase MetC
LigandBDBM50370853
Substrate/Competitorn/a
Meas. Tech.ChEMBL_425863 (CHEMBL856866)
IC50 2200±n/a nM
Citation Ejim, LJBlanchard, JEKoteva, KPSumerfield, RElowe, NHChechetto, JDBrown, EDJunop, MSWright, GD Inhibitors of bacterial cystathionine beta-lyase: leads for new antimicrobial agents and probes of enzyme structure and function. J Med Chem50:755-64 (2007) 
 
Cystathionine beta-lyase MetC
Name:Cystathionine beta-lyase MetC
Type:PROTEIN
Mol. Mass.:43211.38
Organism:Escherichia coli K-12
Description:ChEMBL_425863
Residue:395
BDBM50370853
NameBDBM50370853
Synonyms:CHEMBL221182
TypeSmall organic molecule
Emp. Form.C7H10N2O2S
Mol. Mass.186.232
SMILESCc1ccc(cc1)S(=O)(=O)NN