Reaction Details
TargetCystathionine beta-lyase MetC
LigandBDBM50370865
Substrate/Competitorn/a
Meas. Tech.ChEMBL_425863 (CHEMBL856866)
IC50 1800±n/a nM
Citation Ejim, LJBlanchard, JEKoteva, KPSumerfield, RElowe, NHChechetto, JDBrown, EDJunop, MSWright, GD Inhibitors of bacterial cystathionine beta-lyase: leads for new antimicrobial agents and probes of enzyme structure and function. J Med Chem50:755-64 (2007) 
 
Cystathionine beta-lyase MetC
Name:Cystathionine beta-lyase MetC
Type:PROTEIN
Mol. Mass.:43211.38
Organism:Escherichia coli K-12
Description:ChEMBL_425863
Residue:395
BDBM50370865
NameBDBM50370865
Synonyms:CHEMBL221706
TypeSmall organic molecule
Emp. Form.C6H6Cl2N2O2S
Mol. Mass.241.095
SMILESNNS(=O)(=O)c1ccc(Cl)c(Cl)c1