Reaction Details
TargetCystathionine beta-lyase MetC
LigandBDBM50370867
Substrate/Competitorn/a
Meas. Tech.ChEMBL_425863 (CHEMBL856866)
IC50 3400±n/a nM
Citation Ejim, LJBlanchard, JEKoteva, KPSumerfield, RElowe, NHChechetto, JDBrown, EDJunop, MSWright, GD Inhibitors of bacterial cystathionine beta-lyase: leads for new antimicrobial agents and probes of enzyme structure and function. J Med Chem50:755-64 (2007) 
 
Cystathionine beta-lyase MetC
Name:Cystathionine beta-lyase MetC
Type:PROTEIN
Mol. Mass.:43211.38
Organism:Escherichia coli K-12
Description:ChEMBL_425863
Residue:395
BDBM50370867
NameBDBM50370867
Synonyms:CHEMBL221705
TypeSmall organic molecule
Emp. Form.C9H9N3O2S2
Mol. Mass.255.317
SMILESNNS(=O)(=O)c1ccc(s1)-c1ccccn1