Reaction Details
TargetVasopressin V1b receptor
LigandBDBM50205292
Substrate/Competitorn/a
Meas. Tech.ChEMBL_425924 (CHEMBL907379)
Ki 0.6±n/a nM
Citation Pena, AMurat, BTrueba, MVentura, MAWo, NCSzeto, HHCheng, LLStoev, SGuillon, GManning, M Design and synthesis of the first selective agonists for the rat vasopressin V(1b) receptor: based on modifications of deamino-[Cys1]arginine vasopressin at positions 4 and 8. J Med Chem50:835-47 (2007) 
 
Vasopressin V1b receptor
Name:Vasopressin V1b receptor
Type:Enzyme Catalytic Domain
Mol. Mass.:47104.48
Organism:RAT
Description:VASOPRESSIN V1B AVPR1B RAT::P48974
Residue:425
BDBM50205292
NameBDBM50205292
Synonyms:CHEMBL385068 | d[Arg4,Orn8]VP
TypeSmall organic molecule
Emp. Form.C46H66N14O11S2
Mol. Mass.1055.233
SMILESNCCC[C@H](NC(=O)[C@@H]1CCCN1C(=O)[C@@H]1CSSCCC(=O)N[C@@H](Cc2ccc(O)cc2)C(=O)N[C@@H](Cc2ccccc2)C(=O)N[C@@H](CCCNC(N)=N)C(=O)N[C@@H](CC(N)=O)C(=O)N1)C(=O)NCC(N)=O