Reaction Details
TargetVasopressin V1b receptor
LigandBDBM50205297
Substrate/Competitorn/a
Meas. Tech.ChEMBL_425924 (CHEMBL907379)
Ki 0.25±n/a nM
Citation Pena, AMurat, BTrueba, MVentura, MAWo, NCSzeto, HHCheng, LLStoev, SGuillon, GManning, M Design and synthesis of the first selective agonists for the rat vasopressin V(1b) receptor: based on modifications of deamino-[Cys1]arginine vasopressin at positions 4 and 8. J Med Chem50:835-47 (2007) 
 
Vasopressin V1b receptor
Name:Vasopressin V1b receptor
Type:Enzyme Catalytic Domain
Mol. Mass.:47104.48
Organism:RAT
Description:VASOPRESSIN V1B AVPR1B RAT::P48974
Residue:425
BDBM50205297
NameBDBM50205297
Synonyms:CHEMBL412973 | d[Leu4,Dab8]VP
TypeSmall organic molecule
Emp. Form.C45H63N11O11S2
Mol. Mass.998.179
SMILESCC(C)C[C@@H]1NC(=O)[C@H](Cc2ccccc2)NC(=O)[C@H](Cc2ccc(O)cc2)NC(=O)CCSSC[C@H](NC(=O)[C@H](CC(N)=O)NC1=O)C(=O)N1CCC[C@H]1C(=O)N[C@@H](CCN)C(=O)NCC(N)=O