Reaction Details
TargetFatty-acid amide hydrolase 1
LigandBDBM50204512
Substrate/Competitorn/a
Meas. Tech.ChEMBL_428054 (CHEMBL914372)
IC50 6.5±n/a nM
Citation Romero, FADu, WHwang, IRayl, TJKimball, FSLeung, DHoover, HSApodaca, RLBreitenbucher, JGCravatt, BFBoger, DL Potent and selective alpha-ketoheterocycle-based inhibitors of the anandamide and oleamide catabolizing enzyme, fatty acid amide hydrolase. J Med Chem50:1058-68 (2007) 
 
Fatty-acid amide hydrolase 1
Name:Fatty-acid amide hydrolase 1
Type:Protein
Mol. Mass.:63071.19
Organism:Homo sapiens (Human)
Description:O00519
Residue:579
BDBM50204512
NameBDBM50204512
Synonyms:2-(7-phenylheptanoyl)oxazole-5-carbonitrile | CHEMBL220770
TypeSmall organic molecule
Emp. Form.C17H18N2O2
Mol. Mass.282.337
SMILESO=C(CCCCCCc1ccccc1)c1ncc(o1)C#N