Reaction Details
TargetFatty-acid amide hydrolase 1
LigandBDBM50157136
Substrate/Competitorn/a
Meas. Tech.ChEMBL_428054 (CHEMBL914372)
Ki 12±n/a nM
Citation Romero, FADu, WHwang, IRayl, TJKimball, FSLeung, DHoover, HSApodaca, RLBreitenbucher, JGCravatt, BFBoger, DL Potent and selective alpha-ketoheterocycle-based inhibitors of the anandamide and oleamide catabolizing enzyme, fatty acid amide hydrolase. J Med Chem50:1058-68 (2007) 
 
Fatty-acid amide hydrolase 1
Name:Fatty-acid amide hydrolase 1
Type:Protein
Mol. Mass.:63071.19
Organism:Homo sapiens (Human)
Description:O00519
Residue:579
BDBM50157136
NameBDBM50157136
Synonyms:1-(5-(furan-2-yl)oxazol-2-yl)-7-phenylheptan-1-one CHEMBL177356
TypeSmall organic molecule
Emp. Form.C20H21NO3
Mol. Mass.323.3856
SMILESO=C(CCCCCCc1ccccc1)c1ncc(o1)-c1ccco1