Reaction Details
TargetP-selectin
LigandBDBM50205377
Substrate/Competitorn/a
Meas. Tech.ChEMBL_428317 (CHEMBL917095)
IC50 870±n/a nM
Citation Kranich, RBusemann, ASBock, DSchroeter-Maas, SBeyer, DHeinemann, BMeyer, MSchierhorn, KZahlten, RWolff, GAydt, EM Rational design of novel, potent small molecule pan-selectin antagonists. J Med Chem50:1101-15 (2007) 
 
P-selectin
Name:P-selectin
Type:PROTEIN
Mol. Mass.:90834.61
Organism:Homo sapiens (Human)
Description:ChEMBL_1438999
Residue:830
BDBM50205377
NameBDBM50205377
Synonyms:CHEMBL220254 | {2'-[(3,4,5-trihydroxybenzoyl)oxy]-1,1'-biphenyl-3-yl}acetic acid
TypeSmall organic molecule
Emp. Form.C21H16O7
Mol. Mass.380.3475
SMILESOC(=O)Cc1cccc(c1)-c1ccccc1OC(=O)c1cc(O)c(O)c(O)c1