Reaction Details
TargetP2Y purinoceptor 2
LigandBDBM50366480
Substrate/Competitorn/a
Meas. Tech.ChEMBL_428323 (CHEMBL917101)
EC50 85±n/a nM
Citation Ivanov, AAKo, HCosyn, LMaddileti, SBesada, PFricks, ICostanzi, SHarden, TKCalenbergh, SVJacobson, KA Molecular modeling of the human P2Y2 receptor and design of a selective agonist, 2'-amino-2'-deoxy-2-thiouridine 5'-triphosphate. J Med Chem50:1166-76 (2007) 
 
P2Y purinoceptor 2
Name:P2Y purinoceptor 2
Type:PROTEIN
Mol. Mass.:42299.21
Organism:Homo sapiens (Human)
Description:ChEMBL_1455361
Residue:377
BDBM50366480
NameBDBM50366480
Synonyms:ADENOSINE TRIPHOSPHATE | ATP
TypeSmall organic molecule
Emp. Form.C10H16N5O13P3
Mol. Mass.507.181
SMILESNc1ncnc2n(cnc12)[C@@H]1O[C@H](CO[P@](O)(=O)O[P@@](O)(=O)OP(O)(O)=O)[C@@H](O)[C@H]1O