Reaction Details
TargetBroad substrate specificity ATP-binding cassette transporter ABCG2
LigandBDBM50370873
Substrate/Competitorn/a
Meas. Tech.ChEMBL_428971 (CHEMBL919518)
IC50 2500±n/a nM
Citation Ahmed-Belkacem, AMacalou, SBorrelli, FCapasso, RFattorusso, ETaglialatela-Scafati, ODi Pietro, A Nonprenylated rotenoids, a new class of potent breast cancer resistance protein inhibitors. J Med Chem50:1933-8 (2007) 
 
Broad substrate specificity ATP-binding cassette transporter ABCG2
Name:Broad substrate specificity ATP-binding cassette transporter ABCG2
Type:Multi-pass membrane protein; monomer or homodimer; disulfide-linked
Mol. Mass.:72329.48
Organism:Homo sapiens (Human)
Description:Q9UNQ0
Residue:655
BDBM50370873
NameBDBM50370873
Synonyms:CHEMBL222265
TypeSmall organic molecule
Emp. Form.C19H16O7
Mol. Mass.356.3261
SMILESCOC1Oc2c(O)cccc2-c2c1oc1cc(OC)c(C)c(O)c1c2=O