Reaction Details
TargetATP-dependent translocase ABCB1
LigandBDBM50207919
Substrate/Competitorn/a
Meas. Tech.ChEMBL_429163 (CHEMBL914418)
EC50 17±n/a nM
Citation Kaiser, DTerfloth, LKopp, SSchulz, Jde Laet, RChiba, PEcker, GFGasteiger, J Self-organizing maps for identification of new inhibitors of P-glycoprotein. J Med Chem50:1698-702 (2007) 
 
ATP-dependent translocase ABCB1
Name:ATP-dependent translocase ABCB1
Type:Protein
Mol. Mass.:141503.50
Organism:Homo sapiens (Human)
Description:P08183
Residue:1280
BDBM50207919
NameBDBM50207919
Synonyms:1-(4,5-dichloro-2-(2-hydroxy-3-(4-o-tolylpiperazin-1-yl)propoxy)phenyl)-3-phenylpropan-1-one | CHEMBL436305
TypeSmall organic molecule
Emp. Form.C29H32Cl2N2O3
Mol. Mass.527.482
SMILESCc1ccccc1N1CCN(CC(O)COc2cc(Cl)c(Cl)cc2C(=O)CCc2ccccc2)CC1