Reaction Details
TargetATP-dependent translocase ABCB1
LigandBDBM50370882
Substrate/Competitorn/a
Meas. Tech.ChEMBL_429163 (CHEMBL914418)
EC50 13±n/a nM
Citation Kaiser, DTerfloth, LKopp, SSchulz, Jde Laet, RChiba, PEcker, GFGasteiger, J Self-organizing maps for identification of new inhibitors of P-glycoprotein. J Med Chem50:1698-702 (2007) 
 
ATP-dependent translocase ABCB1
Name:ATP-dependent translocase ABCB1
Type:Protein
Mol. Mass.:141503.50
Organism:Homo sapiens (Human)
Description:P08183
Residue:1280
BDBM50370882
NameBDBM50370882
Synonyms:CHEMBL222351
TypeSmall organic molecule
Emp. Form.C31H39N3O3
Mol. Mass.501.6597
SMILESCN(C)c1ccc(CCC(=O)c2ccccc2OCC(O)CN2CCN(CC2)c2ccccc2C)cc1