Reaction Details
TargetATP-dependent translocase ABCB1
LigandBDBM50207957
Substrate/Competitorn/a
Meas. Tech.ChEMBL_429163 (CHEMBL914418)
EC50 137±n/a nM
Citation Kaiser, DTerfloth, LKopp, SSchulz, Jde Laet, RChiba, PEcker, GFGasteiger, J Self-organizing maps for identification of new inhibitors of P-glycoprotein. J Med Chem50:1698-702 (2007) 
 
ATP-dependent translocase ABCB1
Name:ATP-dependent translocase ABCB1
Type:Protein
Mol. Mass.:141503.50
Organism:Homo sapiens (Human)
Description:P08183
Residue:1280
BDBM50207957
NameBDBM50207957
Synonyms:3-phenyl-1-(2-(8-(piperidin-1-yl)octyloxy)phenyl)propan-1-one | CHEMBL223130
TypeSmall organic molecule
Emp. Form.C28H39NO2
Mol. Mass.421.6148
SMILESO=C(CCc1ccccc1)c1ccccc1OCCCCCCCCN1CCCCC1