Reaction Details
TargetATP-dependent translocase ABCB1
LigandBDBM50134999
Substrate/Competitorn/a
Meas. Tech.ChEMBL_429163 (CHEMBL914418)
EC50 110±n/a nM
Citation Kaiser, DTerfloth, LKopp, SSchulz, Jde Laet, RChiba, PEcker, GFGasteiger, J Self-organizing maps for identification of new inhibitors of P-glycoprotein. J Med Chem50:1698-702 (2007) 
 
ATP-dependent translocase ABCB1
Name:ATP-dependent translocase ABCB1
Type:Protein
Mol. Mass.:141503.50
Organism:Homo sapiens (Human)
Description:P08183
Residue:1280
BDBM50134999
NameBDBM50134999
Synonyms:1-(5-(benzyloxy)-2-(2-hydroxy-3-(propylamino)propoxy)phenyl)-3-phenylpropan-1-one CHEMBL148001
TypeSmall organic molecule
Emp. Form.C28H33NO4
Mol. Mass.447.5659
SMILESCCCNCC(O)COc1ccc(OCc2ccccc2)cc1C(=O)CCc1ccccc1