Reaction Details
TargetType-2 angiotensin II receptor
LigandBDBM50208096
Substrate/Competitorn/a
Meas. Tech.ChEMBL_429280 (CHEMBL915840)
Ki 37.5±n/a nM
Citation Georgsson, JSköld, CBotros, MLindeberg, GNyberg, FKarlén, AHallberg, ALarhed, M Synthesis of a new class of druglike angiotensin II C-terminal mimics with affinity for the AT2 receptor. J Med Chem50:1711-5 (2007) 
 
Type-2 angiotensin II receptor
Name:Type-2 angiotensin II receptor
Type:Enzyme Catalytic Domain
Mol. Mass.:41201.61
Organism:Homo sapiens (Human)
Description:Angiotensin II, central 0 0::P50052
Residue:363
BDBM50208096
NameBDBM50208096
Synonyms:(S)-2-(3-((1H-imidazol-1-yl)methyl)benzamido)-3-phenylpropanoic acid | CHEMBL219840
TypeSmall organic molecule
Emp. Form.C20H19N3O3
Mol. Mass.349.3832
SMILESOC(=O)[C@H](Cc1ccccc1)NC(=O)c1cccc(Cn2ccnc2)c1