Reaction Details
TargetType-2 angiotensin II receptor
LigandBDBM50208102
Substrate/Competitorn/a
Meas. Tech.ChEMBL_429280 (CHEMBL915840)
Ki 0.9±n/a nM
Citation Georgsson, JSköld, CBotros, MLindeberg, GNyberg, FKarlén, AHallberg, ALarhed, M Synthesis of a new class of druglike angiotensin II C-terminal mimics with affinity for the AT2 receptor. J Med Chem50:1711-5 (2007) 
 
Type-2 angiotensin II receptor
Name:Type-2 angiotensin II receptor
Type:Enzyme Catalytic Domain
Mol. Mass.:41201.61
Organism:Homo sapiens (Human)
Description:Angiotensin II, central 0 0::P50052
Residue:363
BDBM50208102
NameBDBM50208102
Synonyms:CHEMBL424755 | [4-NH2-Phe6] Ang II
TypeSmall organic molecule
Emp. Form.C50H72N14O12
Mol. Mass.1061.1933
SMILESCC[C@@H](C)[C@H](NC(=O)[C@H](Cc1ccc(O)cc1)NC(=O)[C@@H](NC(=O)[C@H](CCCN=C(N)N)NC(=O)[C@@H](N)CC(O)=O)C(C)C)C(=O)N[C@@H](Cc1cnc[nH]1)C(=O)N1CCC[C@H]1C(=O)N[C@@H](Cc1ccc(N)cc1)C(O)=O