Reaction Details
TargetType-2 angiotensin II receptor
LigandBDBM50208107
Substrate/Competitorn/a
Meas. Tech.ChEMBL_429280 (CHEMBL915840)
Ki>10000±n/a nM
Citation Georgsson, JSköld, CBotros, MLindeberg, GNyberg, FKarlén, AHallberg, ALarhed, M Synthesis of a new class of druglike angiotensin II C-terminal mimics with affinity for the AT2 receptor. J Med Chem50:1711-5 (2007) 
 
Type-2 angiotensin II receptor
Name:Type-2 angiotensin II receptor
Type:Enzyme Catalytic Domain
Mol. Mass.:41201.61
Organism:Homo sapiens (Human)
Description:Angiotensin II, central 0 0::P50052
Residue:363
BDBM50208107
NameBDBM50208107
Synonyms:(S)-2-((S)-1-(3-((1H-imidazol-5-yl)methyl)benzoyl)pyrrolidine-2-carboxamido)-3-phenylpropanoic acid | CHEMBL374726
TypeSmall organic molecule
Emp. Form.C25H26N4O4
Mol. Mass.446.4983
SMILESOC(=O)[C@H](Cc1ccccc1)NC(=O)[C@@H]1CCCN1C(=O)c1cccc(Cc2cnc[nH]2)c1