Reaction Details
TargetType-2 angiotensin II receptor
LigandBDBM50208097
Substrate/Competitorn/a
Meas. Tech.ChEMBL_429280 (CHEMBL915840)
Ki>10000±n/a nM
Citation Georgsson, JSköld, CBotros, MLindeberg, GNyberg, FKarlén, AHallberg, ALarhed, M Synthesis of a new class of druglike angiotensin II C-terminal mimics with affinity for the AT2 receptor. J Med Chem50:1711-5 (2007) 
 
Type-2 angiotensin II receptor
Name:Type-2 angiotensin II receptor
Type:Enzyme Catalytic Domain
Mol. Mass.:41201.61
Organism:Homo sapiens (Human)
Description:Angiotensin II, central 0 0::P50052
Residue:363
BDBM50208097
NameBDBM50208097
Synonyms:(2S,3R)-2-((S)-1-((S)-2-amino-3-(1H-imidazol-5-yl)propanoyl)pyrrolidine-2-carboxamido)-3-methylpentanoic acid | CHEMBL374725
TypeSmall organic molecule
Emp. Form.C17H27N5O4
Mol. Mass.365.4274
SMILESCC[C@@H](C)[C@H](NC(=O)[C@@H]1CCCN1C(=O)[C@@H](N)Cc1cnc[nH]1)C(O)=O