Reaction Details
TargetCreatine kinase M-type
LigandBDBM50370908
Substrate/Competitorn/a
Meas. Tech.ChEMBL_429454 (CHEMBL917153)
Ki 70000±n/a nM
Citation Bretonnet, ASJochum, AWalker, OKrimm, IGoekjian, PMarcillat, OLancelin, JM NMR screening applied to the fragment-based generation of inhibitors of creatine kinase exploiting a new interaction proximate to the ATP binding site. J Med Chem50:1865-75 (2007) 
 
Creatine kinase M-type
Name:Creatine kinase M-type
Type:PROTEIN
Mol. Mass.:43117.10
Organism:Oryctolagus cuniculus
Description:ChEMBL_429452
Residue:381
BDBM50370908
NameBDBM50370908
Synonyms:CHEMBL373782
TypeSmall organic molecule
Emp. Form.C25H17NO5
Mol. Mass.411.4062
SMILESOC(=O)c1ccc(o1)-c1ccc(cc1)C(=O)Nc1ccc(cc1)C(=O)c1ccccc1