Reaction Details
TargetAdenosine receptor A2b
LigandBDBM50208794
Substrate/Competitorn/a
Meas. Tech.ChEMBL_429492 (CHEMBL918614)
EC50 128±n/a nM
Citation Adachi, HPalaniappan, KKIvanov, AABergman, NGao, ZGJacobson, KA Structure-activity relationships of 2,N(6),5'-substituted adenosine derivatives with potent activity at the A2B adenosine receptor. J Med Chem50:1810-27 (2007) 
 
Adenosine receptor A2b
Name:Adenosine receptor A2b
Type:G Protein-Coupled Receptor (GPCR)
Mol. Mass.:36341.22
Organism:Homo sapiens (Human)
Description:n/a
Residue:332
BDBM50208794
NameBDBM50208794
Synonyms:(2R,3R,4S,5R)-2-(6-amino-2-(2-(6-bromo-1H-indol-3-yl)ethoxy)-9H-purin-9-yl)-5-(hydroxymethyl)-tetrahydrofuran-3,4-diol CHEMBL225459
TypeSmall organic molecule
Emp. Form.C20H21BrN6O5
Mol. Mass.505.322
SMILESNc1nc(OCCc2c[nH]c3cc(Br)ccc23)nc2n(cnc12)[C@@H]1O[C@H](CO)[C@@H](O)[C@H]1O