Reaction Details
TargetThymidylate kinase
LigandBDBM50156569
Substrate/Competitorn/a
Meas. Tech.ChEMBL_429556 (CHEMBL919554)
Ki 390000±n/a nM
Citation Vanheusden, VMunier-Lehmann, HFroeyen, MBusson, RRozenski, JHerdewijn, PVan Calenbergh, S Discovery of bicyclic thymidine analogues as selective and high-affinity inhibitors of Mycobacterium tuberculosis thymidine monophosphate kinase. J Med Chem47:6187-94 (2004) 
 
Thymidylate kinase
Name:Thymidylate kinase
Type:PROTEIN
Mol. Mass.:22636.29
Organism:Mycobacterium tuberculosis
Description:ChEMBL_208218
Residue:214
BDBM50156569
NameBDBM50156569
Synonyms:1-[3-aminomethyl-2-chloro-2,3-dideoxy-beta-D-ribofuranosyl]thymine | CHEMBL222242
TypeSmall organic molecule
Emp. Form.C11H16ClN3O4
Mol. Mass.289.715
SMILESCc1cn([C@@H]2O[C@H](CO)[C@@H](CN)[C@H]2Cl)c(=O)[nH]c1=O