Reaction Details
TargetThymidylate kinase
LigandBDBM50118623
Substrate/Competitorn/a
Meas. Tech.ChEMBL_429556 (CHEMBL919554)
Ki 43000±n/a nM
Citation Vanheusden, VMunier-Lehmann, HFroeyen, MBusson, RRozenski, JHerdewijn, PVan Calenbergh, S Discovery of bicyclic thymidine analogues as selective and high-affinity inhibitors of Mycobacterium tuberculosis thymidine monophosphate kinase. J Med Chem47:6187-94 (2004) 
 
Thymidylate kinase
Name:Thymidylate kinase
Type:PROTEIN
Mol. Mass.:22636.29
Organism:Mycobacterium tuberculosis
Description:ChEMBL_208218
Residue:214
BDBM50118623
NameBDBM50118623
Synonyms:(R)-1-((R)-3-Fluoro-4-hydroxy-5-methylphosphate-tetrahydro-furan-2-yl)-5-methyl-1H-pyrimidine-2,4-dione [(2R,3R,4R,5R)-4-fluoro-3-hydroxy-5-(5-methyl-2,4-dioxo-1,2,3,4-tetrahydropyrimidin-1-yl)oxolan-2-yl]methyl phosphate
TypeSmall organic molecule
Emp. Form.C10H12FN2O8P
Mol. Mass.338.1841
SMILESCc1cn([C@@H]2O[C@H](COP([O-])([O-])=O)[C@@H](O)[C@H]2F)c(=O)[nH]c1=O