Reaction Details
TargetThymidylate kinase
LigandBDBM50131909
Substrate/Competitorn/a
Meas. Tech.ChEMBL_429556 (CHEMBL919554)
Ki 57000±n/a nM
Citation Vanheusden, VMunier-Lehmann, HFroeyen, MBusson, RRozenski, JHerdewijn, PVan Calenbergh, S Discovery of bicyclic thymidine analogues as selective and high-affinity inhibitors of Mycobacterium tuberculosis thymidine monophosphate kinase. J Med Chem47:6187-94 (2004) 
 
Thymidylate kinase
Name:Thymidylate kinase
Type:PROTEIN
Mol. Mass.:22636.29
Organism:Mycobacterium tuberculosis
Description:ChEMBL_208218
Residue:214
BDBM50131909
NameBDBM50131909
Synonyms:1-((2R,4R,5S)-4-aminomethyl-5-hydroxymethyl-tetrahydro-furan-2-yl)-5-methyl-1H-pyrimidine-2,4-dione CHEMBL341264
TypeSmall organic molecule
Emp. Form.C11H17N3O4
Mol. Mass.255.2704
SMILESCc1cn([C@H]2C[C@H](CN)[C@@H](CO)O2)c(=O)[nH]c1=O