Reaction Details
TargetAdenosine receptor A2a
LigandBDBM50156643
Substrate/Competitorn/a
Meas. Tech.ChEMBL_429600 (CHEMBL919032)
Ki 7±n/a nM
Citation Peng, HKumaravel, GYao, GSha, LWang, JVan Vlijmen, HBohnert, THuang, CVu, CBEnsinger, CLChang, HEngber, TMWhalley, ETPetter, RC Novel bicyclic piperazine derivatives of triazolotriazine and triazolopyrimidines as highly potent and selective adenosine A2A receptor antagonists. J Med Chem47:6218-29 (2004) 
 
Adenosine receptor A2a
Name:Adenosine receptor A2a
Type:G Protein-Coupled Receptor (GPCR)
Mol. Mass.:45015.65
Organism:Rattus norvegicus (rat)
Description:Rat A2A receptors expressed in CHO cells.
Residue:410
BDBM50156643
NameBDBM50156643
Synonyms:2-(furan-2-yl)-5-((7R,9aS)-7-((quinolin-2-yloxy)methyl)-hexahydro-1H-pyrido[1,2-a]pyrazin-2(6H)-yl)-[1,2,4]triazolo[1,5-a][1,3,5]triazin-7-amine | CHEMBL222530
TypeSmall organic molecule
Emp. Form.C26H27N9O2
Mol. Mass.497.5517
SMILESNc1nc(nc2nc(nn12)-c1ccco1)N1CCN2C[C@H](COc3ccc4ccccc4n3)CC[C@H]2C1