Reaction Details
TargetCysteine protease falcipain-3 [5-492]
LigandBDBM50157736
Substrate/Competitorn/a
Meas. Tech.ChEMBL_430127 (CHEMBL919605)
IC50 5800±n/a nM
Citation Desai, PVPatny, ASabnis, YTekwani, BGut, JRosenthal, PSrivastava, AAvery, M Identification of novel parasitic cysteine protease inhibitors using virtual screening. 1. The ChemBridge database. J Med Chem47:6609-15 (2004) 
 
Cysteine protease falcipain-3 [5-492]
Name:Cysteine protease falcipain-3 [5-492]
Type:PROTEIN
Mol. Mass.:56106.86
Organism:Plasmodium falciparum
Description:ChEMBL_430127
Residue:488
BDBM50157736
NameBDBM50157736
Synonyms:3-((5-(2,3-dihydroxybenzylideneamino)naphthalen-1-ylimino)methyl)benzene-1,2-diol | CHEMBL222325
TypeSmall organic molecule
Emp. Form.C24H18N2O4
Mol. Mass.398.4107
SMILESOc1cccc(\C=N\c2cccc3c(cccc23)\N=C/c2cccc(O)c2O)c1O