Reaction Details
TargetCysteine protease falcipain-3 [5-492]
LigandBDBM50157757
Substrate/Competitorn/a
Meas. Tech.ChEMBL_430127 (CHEMBL919605)
IC50 11800±n/a nM
Citation Desai, PVPatny, ASabnis, YTekwani, BGut, JRosenthal, PSrivastava, AAvery, M Identification of novel parasitic cysteine protease inhibitors using virtual screening. 1. The ChemBridge database. J Med Chem47:6609-15 (2004) 
 
Cysteine protease falcipain-3 [5-492]
Name:Cysteine protease falcipain-3 [5-492]
Type:PROTEIN
Mol. Mass.:56106.86
Organism:Plasmodium falciparum
Description:ChEMBL_430127
Residue:488
BDBM50157757
NameBDBM50157757
Synonyms:CHEMBL221991 | N1-((5-((3-oxo-5,6-dihydroimidazo[2,1-b]thiazol-2(3H)-ylidene)methyl)furan-2-yl)methyl)-N2-phenyloxalamide
TypeSmall organic molecule
Emp. Form.C19H16N4O4S
Mol. Mass.396.42
SMILESO=C(NCc1ccc(\C=c2\sc3=NCCn3c2=O)o1)C(=O)Nc1ccccc1