Reaction Details
TargetCysteine protease falcipain-3 [5-492]
LigandBDBM50157753
Substrate/Competitorn/a
Meas. Tech.ChEMBL_430127 (CHEMBL919605)
IC50 13900±n/a nM
Citation Desai, PVPatny, ASabnis, YTekwani, BGut, JRosenthal, PSrivastava, AAvery, M Identification of novel parasitic cysteine protease inhibitors using virtual screening. 1. The ChemBridge database. J Med Chem47:6609-15 (2004) 
 
Cysteine protease falcipain-3 [5-492]
Name:Cysteine protease falcipain-3 [5-492]
Type:PROTEIN
Mol. Mass.:56106.86
Organism:Plasmodium falciparum
Description:ChEMBL_430127
Residue:488
BDBM50157753
NameBDBM50157753
Synonyms:CHEMBL222322 | N'-(1-(4-hydroxy-2-oxo-2H-chromen-3-yl)ethylidene)-4-methylbenzenesulfonohydrazide
TypeSmall organic molecule
Emp. Form.C18H16N2O5S
Mol. Mass.372.395
SMILESC\C(=N/NS(=O)(=O)c1ccc(C)cc1)c1c(O)c2ccccc2oc1=O