Reaction Details
TargetKappa-type opioid receptor
LigandBDBM50157794
Substrate/Competitorn/a
Meas. Tech.ChEMBL_430158 (CHEMBL919067)
EC50 131±n/a nM
Citation Srivastava, SKShefali, SMiller, CNAceto, MDTraynor, JRLewis, JWHusbands, SM Effects of substitution on the pyrrole N atom in derivatives of tetrahydronaltrindole, tetrahydrooxymorphindole, and a related 4,5-epoxyphenylpyrrolomorphinan. J Med Chem47:6645-8 (2004) 
 
Kappa-type opioid receptor
Name:Kappa-type opioid receptor
Type:G Protein-Coupled Receptor (GPCR)
Mol. Mass.:42648.76
Organism:Homo sapiens (Human)
Description:P41145
Residue:380
BDBM50157794
NameBDBM50157794
Synonyms:6,7-didehydro-3,14-dihydroxy-4,5alpha-epoxy-17-methyl-1'phenylethyl-4',5',6',7'-tetrahydroindolo[2',3':6,7]morphinan | CHEMBL222814
TypeSmall organic molecule
Emp. Form.C31H34N2O3
Mol. Mass.482.6133
SMILESCN1CC[C@@]23[C@H]4Oc5c2c(CC1[C@]3(O)Cc1c2CCCCc2n(CCc2ccccc2)c41)ccc5O