Reaction Details
TargetKappa-type opioid receptor
LigandBDBM50157789
Substrate/Competitorn/a
Meas. Tech.ChEMBL_430154 (CHEMBL919063)
Ki 7.4±n/a nM
Citation Srivastava, SKShefali, SMiller, CNAceto, MDTraynor, JRLewis, JWHusbands, SM Effects of substitution on the pyrrole N atom in derivatives of tetrahydronaltrindole, tetrahydrooxymorphindole, and a related 4,5-epoxyphenylpyrrolomorphinan. J Med Chem47:6645-8 (2004) 
 
Kappa-type opioid receptor
Name:Kappa-type opioid receptor
Type:G Protein-Coupled Receptor (GPCR)
Mol. Mass.:42648.76
Organism:Homo sapiens (Human)
Description:P41145
Residue:380
BDBM50157789
NameBDBM50157789
Synonyms:17-cyclopropylmethyl-6-7-didehydro-3,14-dihydroxy-4,5alpha-epoxy-1'-ethyl-4',5',6',7'-tetrahydroindolo[2',3';6,7]morphinan | CHEMBL222486
TypeSmall organic molecule
Emp. Form.C28H34N2O3
Mol. Mass.446.5812
SMILESCCn1c2CCCCc2c2C[C@@]3(O)C4Cc5ccc(O)c6O[C@@H](c12)[C@]3(CCN4CC1CC1)c56