Reaction Details
TargetMu-type opioid receptor
LigandBDBM50157792
Substrate/Competitorn/a
Meas. Tech.ChEMBL_430153 (CHEMBL919062)
Ki 5.8±n/a nM
Citation Srivastava, SKShefali, SMiller, CNAceto, MDTraynor, JRLewis, JWHusbands, SM Effects of substitution on the pyrrole N atom in derivatives of tetrahydronaltrindole, tetrahydrooxymorphindole, and a related 4,5-epoxyphenylpyrrolomorphinan. J Med Chem47:6645-8 (2004) 
 
Mu-type opioid receptor
Name:Mu-type opioid receptor
Type:G Protein-Coupled Receptor (GPCR)
Mol. Mass.:44789.51
Organism:Homo sapiens (Human)
Description:P35372
Residue:400
BDBM50157792
NameBDBM50157792
Synonyms:17-cyclopropylmethyl-6-7-didehydro-3,14-dihydroxy-4,5alpha-epoxy-1'-methyl-4',5',6',7'-tetrahydroindolo[2',3';6,7]morphinan | 22-cyclopropylmethyl-11-methyl-(1S,2S,13R)-14-oxa-11,22-diazaheptacyclo[13.9.1.01,13.02,21.04,12.05,10.019,25]pentacosa-4(12),5(10),15,17,19(25)-pentaene-2,16-diol
TypeSmall organic molecule
Emp. Form.C27H32N2O3
Mol. Mass.432.5546
SMILESCn1c2CCCCc2c2C[C@@]3(O)C4Cc5ccc(O)c6O[C@@H](c12)[C@]3(CCN4CC1CC1)c56