Reaction Details
TargetMu-type opioid receptor
LigandBDBM50157798
Substrate/Competitorn/a
Meas. Tech.ChEMBL_430153 (CHEMBL919062)
Ki 2.5±n/a nM
Citation Srivastava, SKShefali, SMiller, CNAceto, MDTraynor, JRLewis, JWHusbands, SM Effects of substitution on the pyrrole N atom in derivatives of tetrahydronaltrindole, tetrahydrooxymorphindole, and a related 4,5-epoxyphenylpyrrolomorphinan. J Med Chem47:6645-8 (2004) 
 
Mu-type opioid receptor
Name:Mu-type opioid receptor
Type:G Protein-Coupled Receptor (GPCR)
Mol. Mass.:44789.51
Organism:Homo sapiens (Human)
Description:P35372
Residue:400
BDBM50157798
NameBDBM50157798
Synonyms:CHEMBL222597 | l',17-dicyclopropylmethyl-6-7-didehydro-3,14-dihydroxy-4,5alpha-epoxy-4',5',6',7'-tetrahydroindolo[2',3';6,7]morphinan
TypeSmall organic molecule
Emp. Form.C30H36N2O3
Mol. Mass.472.6184
SMILESOc1ccc2CC3N(CC4CC4)CC[C@@]45[C@@H](Oc1c24)c1c(C[C@@]35O)c2CCCCc2n1CC1CC1