Reaction Details
TargetThymidylate synthase
LigandBDBM50158422
Substrate/Competitorn/a
Meas. Tech.ChEMBL_430412 (CHEMBL916821)
IC50 54±n/a nM
Citation Gangjee, AJain, HDMcGuire, JJKisliuk, RL Benzoyl ring halogenated classical 2-amino-6-methyl-3,4-dihydro-4-oxo-5-substituted thiobenzoyl-7H-pyrrolo[2,3-d]pyrimidine antifolates as inhibitors of thymidylate synthase and as antitumor agents. J Med Chem47:6730-9 (2004) 
 
Thymidylate synthase
Name:Thymidylate synthase
Type:Enzyme
Mol. Mass.:35718.07
Organism:Homo sapiens (Human)
Description:n/a
Residue:313
BDBM50158422
NameBDBM50158422
Synonyms:CHEMBL388340 | N-[4-[(2-amino-6-methyl-3,4-dihydro-4-oxo-7H-pyrrolo-[2,3-d]pyrimidin-5-yl)thio]-2'fluorobenzoyl]L-glutamic acid
TypeSmall organic molecule
Emp. Form.C19H18FN5O6S
Mol. Mass.463.44
SMILESCc1[nH]c2nc(N)[nH]c(=O)c2c1Sc1ccc(C(=O)N[C@@H](CCC(O)=O)C(O)=O)c(F)c1