Reaction Details
TargetThymidylate synthase
LigandBDBM18797
Substrate/Competitorn/a
Meas. Tech.ChEMBL_430412 (CHEMBL916821)
IC50 54±n/a nM
Citation Gangjee, AJain, HDMcGuire, JJKisliuk, RL Benzoyl ring halogenated classical 2-amino-6-methyl-3,4-dihydro-4-oxo-5-substituted thiobenzoyl-7H-pyrrolo[2,3-d]pyrimidine antifolates as inhibitors of thymidylate synthase and as antitumor agents. J Med Chem47:6730-9 (2004) 
 
Thymidylate synthase
Name:Thymidylate synthase
Type:Enzyme
Mol. Mass.:35718.07
Organism:Homo sapiens (Human)
Description:n/a
Residue:313
BDBM18797
NameBDBM18797
Synonyms:(2S)-2-{[4-({2-amino-6-methyl-4-oxo-3H,4H,7H-pyrrolo[2,3-d]pyrimidin-5-yl}sulfanyl)phenyl]formamido}pentanedioic acid Pyrrolo[2,3-d]pyrimidine analogue, 1
TypeSmall organic molecule
Emp. Form.C19H19N5O6S
Mol. Mass.445.449
SMILESCc1[nH]c2nc(N)[nH]c(=O)c2c1Sc1ccc(cc1)C(=O)N[C@@H](CCC(O)=O)C(O)=O