Reaction Details
TargetDihydrofolate reductase
LigandBDBM18796
Substrate/Competitorn/a
Meas. Tech.ChEMBL_430598 (CHEMBL918700)
IC50 230000±n/a nM
Citation Gangjee, AZeng, YMcGuire, JJMehraein, FKisliuk, RL Synthesis of classical, three-carbon-bridged 5-substituted furo[2,3-d]pyrimidine and 6-substituted pyrrolo[2,3-d]pyrimidine analogues as antifolates. J Med Chem47:6893-901 (2004) 
 
Dihydrofolate reductase
Name:Dihydrofolate reductase
Type:n/a
Mol. Mass.:17532.46
Organism:Escherichia coli
Description:n/a
Residue:157
BDBM18796
NameBDBM18796
Synonyms:(2S)-2-{[4-(2-{2-amino-4-oxo-1H,4H,7H-pyrrolo[2,3-d]pyrimidin-5-yl}ethyl)phenyl]formamido}pentanedioic acid Pemetrexed
TypeSmall organic molecule
Emp. Form.C20H21N5O6
Mol. Mass.427.4106
SMILESNc1nc2[nH]cc(CCc3ccc(cc3)C(=O)N[C@@H](CCC(O)=O)C(O)=O)c2c(=O)[nH]1