Reaction Details
TargetDihydrofolate reductase
LigandBDBM50158536
Substrate/Competitorn/a
Meas. Tech.ChEMBL_430597 (CHEMBL918699)
IC50 9000±n/a nM
Citation Gangjee, AZeng, YMcGuire, JJMehraein, FKisliuk, RL Synthesis of classical, three-carbon-bridged 5-substituted furo[2,3-d]pyrimidine and 6-substituted pyrrolo[2,3-d]pyrimidine analogues as antifolates. J Med Chem47:6893-901 (2004) 
 
Dihydrofolate reductase
Name:Dihydrofolate reductase
Type:Enzyme
Mol. Mass.:21453.99
Organism:Homo sapiens (Human)
Description:Recombinant human DHFR.
Residue:187
BDBM50158536
NameBDBM50158536
Synonyms:(S)-2-{4-[3-(2,4-Diamino-furo[2,3-d]pyrimidin-5-yl)-propyl]-benzoylamino}-pentanedioic acid N-{4-[3-(2,4-diaminofuro[2,3-d]pyrimidin-5-yl)propyl]-benzoyl}-L-glutamicacid
TypeSmall organic molecule
Emp. Form.C21H23N5O6
Mol. Mass.441.4372
SMILESNc1nc(N)c2c(CCCc3ccc(cc3)C(=O)N[C@@H](CCC(O)=O)C(O)=O)coc2n1