Reaction Details
TargetDihydrofolate reductase
LigandBDBM18050
Substrate/Competitorn/a
Meas. Tech.ChEMBL_430598 (CHEMBL918700)
IC50 7±n/a nM
Citation Gangjee, AZeng, YMcGuire, JJMehraein, FKisliuk, RL Synthesis of classical, three-carbon-bridged 5-substituted furo[2,3-d]pyrimidine and 6-substituted pyrrolo[2,3-d]pyrimidine analogues as antifolates. J Med Chem47:6893-901 (2004) 
 
Dihydrofolate reductase
Name:Dihydrofolate reductase
Type:n/a
Mol. Mass.:17532.46
Organism:Escherichia coli
Description:n/a
Residue:157
BDBM18050
NameBDBM18050
Synonyms:2-[(4-{[(2,4-diaminopteridin-6-yl)methyl](methyl)amino}phenyl)formamido]pentanedioic acid MTX cid_126941
TypeSmall organic molecule
Emp. Form.C20H22N8O5
Mol. Mass.454.4393
SMILESCN(Cc1cnc2nc(N)nc(N)c2n1)c1ccc(cc1)C(=O)N[C@@H](CCC(O)=O)C(O)=O