Reaction Details
TargetTripeptidyl-peptidase 2
LigandBDBM50176928
Substrate/Competitorn/a
Meas. Tech.ChEMBL_430943 (CHEMBL914885)
Ki 900±n/a nM
Citation Ganellin, CRBishop, PBBambal, RBChan, SMLeblond, BMoore, ANZhao, LBourgeat, PRose, CVargas, FSchwartz, JC Inhibitors of tripeptidyl peptidase II. 3. Derivation of butabindide by successive structure optimizations leading to a potential general approach to designing exopeptidase inhibitors. J Med Chem48:7333-42 (2005) 
 
Tripeptidyl-peptidase 2
Name:Tripeptidyl-peptidase 2
Type:PROTEIN
Mol. Mass.:138287.08
Organism:Rattus norvegicus
Description:ChEMBL_211948
Residue:1249
BDBM50176928
NameBDBM50176928
Synonyms:CHEMBL375490 | L-valyl-L-proline hexylamide
TypeSmall organic molecule
Emp. Form.C16H31N3O2
Mol. Mass.297.4362
SMILESCCCCCCNC(=O)[C@@H]1CCCN1C(=O)[C@@H](N)C(C)C