Reaction Details
TargetTripeptidyl-peptidase 2
LigandBDBM50176933
Substrate/Competitorn/a
Meas. Tech.ChEMBL_430943 (CHEMBL914885)
Ki 57000±n/a nM
Citation Ganellin, CRBishop, PBBambal, RBChan, SMLeblond, BMoore, ANZhao, LBourgeat, PRose, CVargas, FSchwartz, JC Inhibitors of tripeptidyl peptidase II. 3. Derivation of butabindide by successive structure optimizations leading to a potential general approach to designing exopeptidase inhibitors. J Med Chem48:7333-42 (2005) 
 
Tripeptidyl-peptidase 2
Name:Tripeptidyl-peptidase 2
Type:PROTEIN
Mol. Mass.:138287.08
Organism:Rattus norvegicus
Description:ChEMBL_211948
Residue:1249
BDBM50176933
NameBDBM50176933
Synonyms:CHEMBL390771 | L-valyl-L-proline piperidinylamide
TypeSmall organic molecule
Emp. Form.C15H28N4O2
Mol. Mass.296.4084
SMILESCC(C)[C@H](N)C(=O)N1CCC[C@H]1C(=O)NN1CCCCC1