Reaction Details
TargetTripeptidyl-peptidase 2
LigandBDBM50176929
Substrate/Competitorn/a
Meas. Tech.ChEMBL_430943 (CHEMBL914885)
Ki 6000±n/a nM
Citation Ganellin, CRBishop, PBBambal, RBChan, SMLeblond, BMoore, ANZhao, LBourgeat, PRose, CVargas, FSchwartz, JC Inhibitors of tripeptidyl peptidase II. 3. Derivation of butabindide by successive structure optimizations leading to a potential general approach to designing exopeptidase inhibitors. J Med Chem48:7333-42 (2005) 
 
Tripeptidyl-peptidase 2
Name:Tripeptidyl-peptidase 2
Type:PROTEIN
Mol. Mass.:138287.08
Organism:Rattus norvegicus
Description:ChEMBL_211948
Residue:1249
BDBM50176929
NameBDBM50176929
Synonyms:CHEMBL375933 | L-valyl-L-prolinamide
TypeSmall organic molecule
Emp. Form.C10H19N3O2
Mol. Mass.213.2768
SMILESCC(C)[C@H](N)C(=O)N1CCC[C@H]1C(N)=O