Reaction Details
TargetTripeptidyl-peptidase 2
LigandBDBM50176934
Substrate/Competitorn/a
Meas. Tech.ChEMBL_430943 (CHEMBL914885)
Ki 80±n/a nM
Citation Ganellin, CRBishop, PBBambal, RBChan, SMLeblond, BMoore, ANZhao, LBourgeat, PRose, CVargas, FSchwartz, JC Inhibitors of tripeptidyl peptidase II. 3. Derivation of butabindide by successive structure optimizations leading to a potential general approach to designing exopeptidase inhibitors. J Med Chem48:7333-42 (2005) 
 
Tripeptidyl-peptidase 2
Name:Tripeptidyl-peptidase 2
Type:PROTEIN
Mol. Mass.:138287.08
Organism:Rattus norvegicus
Description:ChEMBL_211948
Residue:1249
BDBM50176934
NameBDBM50176934
Synonyms:(2S)-aminobutyryl-L-proline n-butylamide | CHEMBL225540
TypeSmall organic molecule
Emp. Form.C13H25N3O2
Mol. Mass.255.3565
SMILESCCCCNC(=O)[C@@H]1CCCN1C(=O)[C@@H](N)CC