Reaction Details
TargetTripeptidyl-peptidase 2
LigandBDBM50176938
Substrate/Competitorn/a
Meas. Tech.ChEMBL_430943 (CHEMBL914885)
Ki 5000±n/a nM
Citation Ganellin, CRBishop, PBBambal, RBChan, SMLeblond, BMoore, ANZhao, LBourgeat, PRose, CVargas, FSchwartz, JC Inhibitors of tripeptidyl peptidase II. 3. Derivation of butabindide by successive structure optimizations leading to a potential general approach to designing exopeptidase inhibitors. J Med Chem48:7333-42 (2005) 
 
Tripeptidyl-peptidase 2
Name:Tripeptidyl-peptidase 2
Type:PROTEIN
Mol. Mass.:138287.08
Organism:Rattus norvegicus
Description:ChEMBL_211948
Residue:1249
BDBM50176938
NameBDBM50176938
Synonyms:CHEMBL388062 | alpha-methylalanyl-L-proline butylamide
TypeSmall organic molecule
Emp. Form.C13H25N3O2
Mol. Mass.255.3565
SMILESCCCCNC(=O)[C@@H]1CCCN1C(=O)C(C)(C)N