Reaction Details
TargetCannabinoid receptor 1
LigandBDBM50176946
Substrate/Competitorn/a
Meas. Tech.ChEMBL_430944 (CHEMBL914886)
Ki 180±n/a nM
Citation Brizzi, ABrizzi, VCascio, MGBisogno, TSirianni, RDi Marzo, V Design, synthesis, and binding studies of new potent ligands of cannabinoid receptors. J Med Chem48:7343-50 (2005) 
 
Cannabinoid receptor 1
Name:Cannabinoid receptor 1
Type:G Protein-Coupled Receptor (GPCR)
Mol. Mass.:52868.96
Organism:Homo sapiens (Human)
Description:P21554
Residue:472
BDBM50176946
NameBDBM50176946
Synonyms:6-(3-hydroxy-4-hexylphenoxy)hexanoic acid cyclopropylamide | CHEMBL223991
TypeSmall organic molecule
Emp. Form.C21H33NO3
Mol. Mass.347.4916
SMILESCCCCCCc1ccc(OCCCCCC(=O)NC2CC2)cc1O